tunniste
label: identifierare @sv

elokuvat
type: Concept
preferred label: filmer @sv
related: trailerit

trailerit
type: Concept
source: Verkko-Kaunokki
source: Webb-Bella @sv
comment: Används om prov ur filmer. Dessa prov visas i biografer i reklamsyfte. @sv
comment: Käytetään elokuvien esittelyfilmeistä, jotka on tehty niiden mainostamiseen elokuvateattereissa.
broader: kulttuuriset tuotokset
in scheme: conceptscheme
preferred label: trailrar @sv
related: elokuvat
candidate: 0
facet: section 3
hide in public side: 0 @sv
tunniste: 45820

kulttuuriset tuotokset
type: Concept
narrower: trailerit