identifierare
label: tunniste @fi

cybernetik
type: Concept
source: Nationalencyklopedin
source: Kielitoimiston sanakirja @fi
comment: säätö- ja viestintäjärjestelmiä ja -tapahtumia tutkiva tiede. @fi
comment: vetenskap som studerar maskiners förmåga att tillgodogöra sig information och kontrollera att detta skett, och i analogi härmed motsvarande förmåga hos levande varelser
in scheme: conceptscheme
preferred label: kybernetiikka @fi
top concept of: conceptscheme
candidate: 0
facet: section 1
hide in public side: 0
identifierare: 42196

cybernetik
type: Concept
preferred label: cybernetics @en
preferred label: kybernetiikka @fi