kammarspel
source: Yrjö Hosiaisluoma: Kirjallisuuden sanakirja @fi
source: Nationalencyklopedin
candidate: 0
in scheme: conceptscheme
comment: Teaterpjäs i mindre format med få roller och sparsam dekor, avsedd att spelas i en liten lokal.
comment: Pienelle näyttämölle tarkoitettu lyhyehkö intiimi näytelmä. @fi
preferred label: kamarinäytelmät @fi
broader: skådespel
identifierare: 45639
facet: section 3
hide in public side: 0
type: Concept

identifierare
label: tunniste @fi

skådespel
preferred label: näytelmät @fi
type: Concept
narrower: kammarspel

skådespel
preferred label: plays @en
preferred label: näytelmät @fi
type: Concept
narrower: kammarspel