ihmisen määrittämä paikka
type: Concept
narrower: vesipuistot

tunniste
label: identifierare @sv

vesipuistot
in scheme: conceptscheme
preferred label: vattenparker @sv
tunniste: 47448
source: Kielitoimiston sanakirja
facet: section 2
comment: viihdekylpylästä, vettä elementtinä hyödyntävästä puistosta tms.
candidate: 0
hide in public side: 0 @sv
broader: ihmisen määrittämä paikka
type: Concept