kulttuuriset tuotokset
type: Concept
narrower: fanifiktio

fanifiktio
type: Concept
alternative label: fan fiction
preferred label: fanfiction
comment: Fanfiction är en term för skönlitterära berättelser skapade av amatörer, alternativt professionella skribenter utan tillstånd, och som utspelar sig i redan existerande fiktiva universum. Företeelsen är vanligt förekommande inom populärkultur, och uppkommer vanligen i kölvattnen till populära tv-serier, tecknade serier, och serier av filmer, romaner och datorspel. @sv
comment: Fanien tuottamaa fiktiivistä tekstiä, jossa lähtökohtana on käytetty jotakin populaarikulttuurin tuotetta, kuten televisiosarjaa, elokuvaa, kirjaa, sarjakuvaa tai julkisuuden henkilöitä. Fanifiktiossa alkuperäistekstin juonta, genreä ja näkökulmaa on muokattu tai laajennettu. Faniyhteisöissä syntyy usein suosittuja juonirakennelmia, joita useat kirjoittajat hyödyntävät. Fanifiktiolle on ominaista, että materiaali on useimmiten julkaistu ilman tekijänoikeuksien haltijoiden lupaa.
tunniste: 48813
facet: section 3
source: Webb-Bella @sv
source: Verkko-Kaunokki
broader: kulttuuriset tuotokset
in scheme: conceptscheme
hide in public side: 0 @sv
candidate: 0

tunniste
label: identifierare @sv