faksimil
preferred label: facsimiles @en
preferred label: näköispainokset @fi
type: Concept

identifierare
label: tunniste @fi

faksimil
comment: exakt avbildning i tryck av t.ex. en handskrift eller en teckning.
hide in public side: 0
preferred label: näköispainokset @fi
top concept of: conceptscheme
type: Concept
identifierare: 45906
source: Nationalencyklopedin
in scheme: conceptscheme
alternative label: faksimile @fi
alternative label: faksimiltryck
facet: section 3
candidate: 0