arvoitukset
tunniste: 45633
hide in public side: 0 @sv
broader: kansankertomukset
facet: section 3
preferred label: gåtor @sv
candidate: 0
type: Concept
source: Yrjö Hosiaisluoma: Kirjallisuuden sanakirja
comment: Vertauskuvallinen ilmaisu, joka sisältää näennäisen, ratkaistavaksi tarkoitetun ongelman. Arvoituksen alalajeja ovat sana-, tavu-, kirjain-, luku-, kuva- ja asiantuntija arvoitus sekä anagrammit.
in scheme: conceptscheme

kansankertomukset
preferred label: folkliga berättelser @sv
type: Concept
narrower: arvoitukset

tunniste
label: identifierare @sv

arvoitukset
preferred label: gåtor @sv
preferred label: riddles @en
type: Concept