riddarromaner
preferred label: -ritariromaanit @en
preferred label: ritariromaanit @fi
type: Concept

romaner
preferred label: romaanit @fi
type: Concept
narrower: riddarromaner

identifierare
label: tunniste @fi

riddarromaner
source: Verkko-Kaunokki @fi
source: Webb-Bella
comment: Används om verk, som beskriver riddarlivet i synnerhet under medeltiden.
comment: Käytetään teoksista, jotka kuvaavat ritareita ja heidän elämäänsä etenkin keskiajalla. @fi
candidate: 0
broader: romaner
preferred label: ritariromaanit @fi
in scheme: conceptscheme
hide in public side: 0
type: Concept
identifierare: 44245
facet: section 3