toimintaan liittyvä rooli
type: Concept
narrower: maailmanparantajat

tunniste
label: identifierare @sv

maailmanparantajat
preferred label: världsförbättrare @sv
in scheme: conceptscheme
tunniste: 46177
comment: vars. halv. ihmisestä joka ilman tarpeellisia edellytyksiä katsoo tehtäväkseen olevien olojen parantamisen.
candidate: 0
hide in public side: 0 @sv
type: Concept
source: Kielitoimiston sanakirja
broader: toimintaan liittyvä rooli
facet: section 6