gruvor
preferred label: mines @en
preferred label: kaivokset @fi
type: Concept

gruvarbetare
preferred label: kaivostyöntekijät @fi
type: Concept
related: gruvor

identifierare
label: tunniste @fi

gruvor
source: Verkko-Kaunokki @fi
source: Webb-Bella
comment: Olika gruvor indexeras enligt produktion; t.ex. gruvor -- stenkol
comment: Eri kaivokset indeksoidaan tuotteensa mukaan esim. kaivokset -- kivihiili @fi
candidate: 0
type: Concept
facet: section 2
preferred label: kaivokset @fi
identifierare: 48891
top concept of: conceptscheme
related: gruvarbetare
hide in public side: 0
in scheme: conceptscheme