vintermörker
preferred label: kaamos @fi
type: Concept

vintermörker
identifierare: 44364
comment: sydäntalven auringoton aika pohjoisessa, kaamosaika. Laajemmin yl. synkästä syksy- ja talviajasta. @fi
candidate: 0
alternative label: kamos
in scheme: conceptscheme
source: Kielitoimiston sanakirja @fi
preferred label: kaamos @fi
hide in public side: 0
facet: section 4
type: Concept
top concept of: conceptscheme

identifierare
label: tunniste @fi