indiankulturer
preferred label: american indian cultures @en
preferred label: intiaanikulttuurit @fi
type: Concept

indiankulturer
facet: section 1
identifierare: 42620
preferred label: intiaanikulttuurit @fi
comment: Olika indiankulturer indexeras t.ex. indiankulturer -- inkaindianer.
comment: Eri intiaanikulttuurit indeksoidaan esim. inkat -- kulttuuri ja intiaanikulttuurit -- inkat. @fi
broader: kulturer
source: Verkko-Kaunokki @fi
source: Webb-Bella
candidate: 0
hide in public side: 0
in scheme: conceptscheme
type: Concept

identifierare
label: tunniste @fi

kulturer
preferred label: kulttuurit @fi
type: Concept
narrower: indiankulturer