hallitsijat
preferred label: regenter @sv
type: Concept
narrower: mogulit

hallitsijat
preferred label: regenter @sv
type: Concept
narrower: mogulit

mogulit
broader: hallitsijat
facet: section 6
source: Kielitoimiston sanakirja
comment: henkilöstä jolla on suuri valta jllak alalla, keisari, magnaatti.
in scheme: conceptscheme
preferred label: moguler @sv
type: Concept