harhat
preferred label: villfarelser @sv
type: Concept
narrower: megalomania

megalomania
source: Verkko-Kaunokki
alternative label: suuruudenhulluus
alternative label: storhetsvansinne @sv
broader: harhat
preferred label: megalomani @sv
type: Concept
comment: Historiallinen käsite, jota toisinaan käytetään merkityksessä suuruudenhulluus, suuruusharha. Megalomaaniselle käytökselle on tunnusomaista pakkomielle tai päähänpinttymä, jonka kohteena on raha, valta, nerokkuus tai kaikkivaltius.
in scheme: conceptscheme
facet: section 1