balladit
preferred label: ballader @sv
broader: runot
hide in public side: 0 @sv
candidate: 0
source: Yrjö Hosiaisluoma: Kirjallisuuden sanakirja
in scheme: conceptscheme
comment: Eeppis-lyyrinen runo, joka kertoo traagisen, jylhän, surumielisen tarinan ihmiskohtaloista.
tunniste: 44093
type: Concept
facet: section 3

balladit
preferred label: ballader @sv
preferred label: ballads @en
type: Concept

tunniste
label: identifierare @sv

runot
preferred label: dikter @sv
type: Concept
narrower: balladit