tunniste
label: identifierare @sv

enkelit
hide in public side: 0 @sv
facet: section 6
candidate: 0
source: Kielitoimiston sanakirja
tunniste: 44905
comment: 1. Jumalan sanansaattajana toimiva ja uskovia suojeleva (siivekkääksi kuvattu) henkiolento. 2. Pimeyden enkeli paholaisen palveluksessa oleva henkiolento.
preferred label: änglar @sv
type: Concept
in scheme: conceptscheme
broader: yliluonnolliset olennot

yliluonnolliset olennot
preferred label: övernaturliga väsen @sv
type: Concept
narrower: enkelit

enkelit
preferred label: angels @en
preferred label: änglar @sv
type: Concept