cybernetik
candidate: 0
top concept of: conceptscheme
type: Concept
identifierare: 42196
comment: säätö- ja viestintäjärjestelmiä ja -tapahtumia tutkiva tiede. @fi
comment: vetenskap som studerar maskiners förmåga att tillgodogöra sig information och kontrollera att detta skett, och i analogi härmed motsvarande förmåga hos levande varelser
hide in public side: 0
source: Nationalencyklopedin
source: Kielitoimiston sanakirja @fi
preferred label: kybernetiikka @fi
in scheme: conceptscheme
facet: section 1

identifierare
label: tunniste @fi

cybernetik
preferred label: cybernetics @en
preferred label: kybernetiikka @fi
type: Concept