mentaaliset ilmiöt
type: Concept
narrower: dystopier

dystopier
source: Nationalencyklopedin
source: Webb-Bella
source: Yrjö Hosiaisluoma: Kirjallisuuden sanakirja @fi
broader: mentaaliset ilmiöt
comment: litterär skildring av ett inhumant, oftast totalitärt framtida samhälle. Exempel är Aldous Huxleys Du sköna nya värld (1932), Karin Boyes Kallocain (1940) och George Orwells 1984 (1949).
comment: Används om verk, som beskriver livet i ett synnerligen illa fungerande samhälle
comment: Ihanneyhteiskunnan vastakohta, pelon utopia. Dystopioiden kuvaus on merkittävä tieteiskirjallisuuden ja poliittisen satiirin muoto, joka on usein suuntautunut totalitaarisia yhteiskuntamuotoja vastaan. @fi
candidate: 0
hide in public side: 0
facet: section 3
in scheme: conceptscheme
type: Concept
identifierare: 44124
alternative label: antiutopiat @fi
alternative label: utopiska romaner
alternative label: antiutopier
alternative label: utopistiset romaanit @fi
preferred label: dystopiat @fi
related: utopier

utopier
preferred label: utopiat @fi
type: Concept
related: dystopier

identifierare
label: tunniste @fi