romaanit
preferred label: romaner @sv
type: Concept
narrower: episodiromaanit

tunniste
label: identifierare @sv

romaanit
preferred label: romaner @sv
preferred label: novels @en
type: Concept
narrower: episodiromaanit

episodiromaanit
type: Concept
tunniste: 45624
preferred label: episodromaner @sv
source: Verkko-Kaunokki
broader: romaanit
facet: section 3
candidate: 0
hide in public side: 0 @sv
in scheme: conceptscheme
comment: Käytetään romaaneista, jotka koostuvat useista erillisistä tai toisiinsa löyhästi, esimerkiksi miljöön avulla, liittyvistä tarinoista (mukailtu Verkko-Kaunokin episodielokuvan määritelmästä).