sisäiset ominaisuudet
type: Concept
narrower: lakonisuus

lakonisuus
hide in public side: 0 @sv
candidate: 0
facet: section 1
broader: sisäiset ominaisuudet
source: Kielitoimiston sanakirja
tunniste: 42834
in scheme: conceptscheme
type: Concept
preferred label: lakonism @sv
comment: puhe-, esitystavasta: lyhyt(sanainen), ytimekäs.

tunniste
label: identifierare @sv