toisenlaiseksi muuttaminen
type: Concept
narrower: vahvistus (vahventaminen)

vahvistus (vahventaminen)
broader: toisenlaiseksi muuttaminen
source: Kielitoimiston sanakirja
comment: tehdä vahv(emm)aksi vars. lisäämällä t. parantamalla jnk lujuutta, kestävyyttä, vakautta, voimaa, tehoa, määrää tms., vahventaa
alternative label: vahvistus
in scheme: conceptscheme
preferred label: förstärkning @sv
type: Concept