metonymia
type: Concept
in scheme: conceptscheme
preferred label: metonymy @en
related: metafora
scope note: Sanan korvaaminen toisella siihen olennaisesti liittyvällä ilmaisulla.
top concept of: conceptscheme

metafora
type: Concept
preferred label: metaphor @en
related: metonymia

metonymia
type: Concept
preferred label: metonymi @sv
preferred label: metonymy @en