kirjallisuudellisuus
type: Concept
broader: sisäiset ominaisuudet
in scheme: conceptscheme
preferred label: literariness @en
related: formalismi
scope note: The sum of special linguistic and formal properties that distinguish literary texts from non‐literary texts, according to the theories of Russian Formalism. @en
scope note: Tekstin ja taideteoksen itsenäisyyttä ja erillisyyttä niin kirjailijasta itsestään kuin yhteiskunnallisista oloista korostava tutkimussuuntaus.

formalismi
type: Concept
preferred label: formalism @en
related: kirjallisuudellisuus

sisäiset ominaisuudet
type: Concept
narrower: kirjallisuudellisuus
preferred label: inre egenskaper @sv
preferred label: internal qualities @en