dialect literature
type: Concept
preferred label: murrekirjallisuus @fi
related: slang

slang
type: Concept
in scheme: conceptscheme
preferred label: slangi @fi
related: dialect literature
related: dialects
scope note: Slang is the use of informal words and expressions that are not considered standard in the speaker's dialect or language.
scope note: Jonkin ikä-, ammatti-, harrastaja- tms. sosiaalisen ryhmän käyttämä, sanastoltaan ja tyyliltään yleiskielestä poikkeava puhekieli. Slangi ei ole paikallismurre eikä erikoisalan kieltä. (Kielitoimiston sanakirja, Wikipedia) @fi
top concept of: conceptscheme

dialects
type: Concept
preferred label: murteet @fi
related: slang

slang
type: Concept
preferred label: slangi @fi