tiedontallennus
type: Concept
narrower: digitaalinen tallennus
preferred label: datalagring @sv
preferred label: information storage @en

digitaalinen tallennus
type: Concept
alternative label: digitointi
alternative label: digitalisointi
broader: tiedontallennus
in scheme: conceptscheme
preferred label: digital recording @en
preferred label: digitalisering @sv
scope note: digitaalinen tallennus + digitalisoituminen= digitalisering @sv