essee
preferred label: essay @en
type: Concept
related: aforismi

aforismi
broader: proosa (kaunokirjallisuus)
scope note: Yksiköllistä muotoa käytetään tarkoitettaessa aforismia kirjallisuudenlajina. Konkreettisista aforismeista puhuttaessa käytetään monikkoa.
related: essee
alternative label: mietelmä
in scheme: conceptscheme
preferred label: aphorism @en
type: Concept

proosa (kaunokirjallisuus)
preferred label: prose (fiction) @en
type: Concept
narrower: aforismi