kotiseutuneuvokset
broader: titles
scope note: In singular, 'kotiseutuneuvos', in plural 'kotiseutuneuvokset'.
in scheme: conceptscheme
type: Concept

titles
preferred label: titlar @sv
preferred label: arvonimet @fi
type: Concept
narrower: kotiseutuneuvokset