ihmisen määrittämä paikka
type: Concept
narrower: käräjäympyrät

käräjäympyrät
creator: Museoalan asiasanasto
broader: ihmisen määrittämä paikka
scope note: kivikehä, jota on käytetty oikeudenkäyntipaikkana
in scheme: conceptscheme
type: Concept