kangas
type: Concept
narrower: neulos

neulos
date: 18.01.2004
creator: Suvi Kettula
broader: kangas
scope note: trikootekniikalla valmistettu kangas, jossa yksi tai useampia lankoja ja /tai lankajärjetelmiä on sitoutunut silmukoina toisiinsa yhtenäiseksi kankaaksi (Markula 1980)
narrower: trikoo
in scheme: conceptscheme
type: Concept

trikoo
type: Concept
broader: neulos