Pragmatik
type: Concept
preferred label: pragmaatika @et
preferred label: pragmatics @en
preferred label: pragmatiikka @fi
related: Diskurspartikel

Diskurspartikel
type: Concept
comment: Asiasanastossa: partikkelit + pragmatiikka (fi), partiklid + pragmaatika (et), Partikeln + Pragmatik (de), particles + pragmatics (en).
broader: Partikeln
in scheme: conceptscheme
preferred label: discourse particle @en
preferred label: diskurssipartikkeli @fi
related: Pragmatik
sem tag: diskurssipartikkeli

Partikeln
type: Concept
narrower: Diskurspartikel
preferred label: partiklid @et
preferred label: partikkelit @fi
preferred label: particles @en