proto-language
type: Concept
preferred label: kantakieli @et
preferred label: Ursprache @de
related: Proto-Finnic

Proto-Finnic
type: Concept
comment: Asiasanastossa: itämerensuomalaiset kielet + kantakieli (fi), Baltic-Finnic + proto-language (en), läänemeresoome keele + kantakieli (et), Ostseefinnische Sprachen + Ursprache (de).
in scheme: conceptscheme
preferred label: kantasuomi @fi
preferred label: Urfinnisch @de
related: proto-language
top concept of: conceptscheme
sem tag: kantasuomi

proto-finnic
type: Concept
preferred label: urfinska @sv
preferred label: kantasuomi @fi