broader
comment: alkuperäisestä aineistosta peräisin oleva tieto

etymologia (tieteet)
type: Concept
preferred label: Etymologie @de
preferred label: etümoloogia @et
preferred label: etymology (sciences) @en
related: etymologiset sanakirjat

sanakirjat
type: Concept
narrower: etymologiset sanakirjat
preferred label: Wörterbücher @de
preferred label: sõnaraamatud @et
preferred label: dictionaries @en

etymologiset sanakirjat
type: Concept
comment: Asiasanastossa: etymologia + sanakirjat (fi), Etymologie + Wörterbücher (de), etümoloogia + sõnaraamatud (et), etymology + dictionaries (en).
broader: sanakirjat
in scheme: conceptscheme
preferred label: etymologische Wörterbücher @de
preferred label: etymological dictionaries @en
related: etymologia (tieteet)
sem tag: etymologiset sanakirjat