derivatives
type: Concept
narrower: nominal derivatives
preferred label: Derivate @de
preferred label: tuletised @et
preferred label: johdokset @fi

nouns
type: Concept
preferred label: Nomina @de
preferred label: noomenid @et
preferred label: nominit @fi
related: nominal derivatives

nominal derivatives
type: Concept
comment: Asiasanastossa: nominit + johdokset (fi), Nomina + Derivate (de), nouns + derivatives (en), noomenid + tuletised (et).
broader: derivatives
in scheme: conceptscheme
preferred label: nominaalderivaadid @et
preferred label: nominijohdokset @fi
preferred label: denominale Ableitungen @de
related: nouns
sem tag: nominijohdokset