broader
comment: alkuperäisestä aineistosta peräisin oleva tieto

Wörterbücher
type: Concept
narrower: Phraseologie + Wörterbücher
preferred label: sõnaraamatud @et
preferred label: dictionaries @en
preferred label: sanakirjat @fi

Phraseologie + Wörterbücher
type: Concept
comment: Asiasanastossa: fraseologia + sanakirjat
alternative label: phrase dictionaries @en
alternative label: phraseologische Wörterbücher
alternative label: fraasisõnaraamatud @et
broader: Wörterbücher
in scheme: conceptscheme
preferred label: fraasisanakirjat @fi
preferred label: phraseology + dictionaries @en
preferred label: fraseoloogia + sõnaraamatud @et
sem tag: fraasisanakirjat