national literature
type: Concept
broader: cultural accomplishments
preferred label: nationallitteratur @sv
preferred label: kansalliskirjallisuus @fi
source: Kielitoimiston sanakirja
comment: se osa kansan kirjallisuutta, jossa kansan ominaispiirteet selvimmin ilmenevät
in scheme: conceptscheme

cultural accomplishments
type: Concept
preferred label: kulttuuriset tuotokset @fi
narrower: national literature