uskonnon spesialistit
type: Concept
narrower: gurut
preferred label: religious specialists @en

gurut
type: Concept
broader: uskonnon spesialistit
in scheme: conceptscheme
preferred label: gurus @en
scope note: (Intialaiset) uskonnolliset ja hengelliset opettajat
scope note: (Indian) religious teachers and spiritual guides @en

gurut
type: Concept
preferred label: gurus @en
preferred label: guruer @sv