tekstianalyysi
type: Concept
preferred label: textual analysis @en
related: tekstualisaatio

tekstualisaatio
type: Concept
in scheme: conceptscheme
preferred label: textualization @en
related: keruu
related: tekstianalyysi
scope note: The process of textualizing, e.g. rendering oral tradition (orality) as text @en
scope note: Tarkoittaa tekstiksi tuottamista, liittyy mm. suullisen perinteen (suullisuuden) kirjalliseen esittämiseen ja siihen liittyviin käytänteisiin (ks. http://www.helsinki.fi/folkloristiikka/Anttonen/mita.htm)
top concept of: conceptscheme

keruu
type: Concept
preferred label: collecting @en
related: tekstualisaatio

tekstualisaatio
type: Concept
preferred label: textualisering @sv