kulttuurimaisema
type: Concept
alternative label: perinnemaisema
broader: maisema
in scheme: conceptscheme
preferred label: cultural landscape @en
related: kulttuuriympäristö
scope note: Maisema jossa on viljelyksiä, rakennuksia ym. ihmisen vaikutuksesta syntynyttä luonnonmaiseman vastakohtana (Lähde: Kielitoimiston sanakirja)
scope note: Cultural landscapes represent the combined works of nature and of man. The term embraces a diversity of manifestations of the interaction between humankind and its natural environment. (Source: UNESCO World Heritage Cenre) @en

kulttuuriympäristö
type: Concept
preferred label: cultural environment @en
related: kulttuurimaisema

maisema
type: Concept
narrower: kulttuurimaisema
preferred label: landscape @en

kulttuurimaisema
type: Concept
preferred label: kulturlandskap @sv
preferred label: cultural landscape @en