suullinen perinne
type: Concept
narrower: booklore
preferred label: oral tradition @en

arkkikirjallisuus
type: Concept
preferred label: chapbooks @en
related: booklore

kirjalliset lähteet
type: Concept
preferred label: literary sources @en
related: booklore

booklore
type: Concept
broader: suullinen perinne
in scheme: conceptscheme
related: kirjalliset lähteet
related: arkkikirjallisuus
scope note: Oral tradition based on written and printed sources (Source: Perinteentutkimuksen terminologia) @en
scope note: Tarkoittaa sellaista suullisen perinteen aineistoa, joka välittömästi tai välillisesti pohjautuu kirjallisiin ja painettuihin lähteisiin