expatriate Finns
type: Concept
narrower: Forest Finns
preferred label: ulkosuomalaiset @fi

Forest Finns
type: Concept
broader: expatriate Finns
in scheme: conceptscheme
preferred label: metsäsuomalaiset @fi
scope note: Finns living in the forest areas of Middle Scandinavia (Source: Kielitoimiston sanakirja)
scope note: Keski-Skandinavian metsäalueilla asunut suomalaisväestö (Lähde: Kielitoimiston sanakirja) @fi

Forest Finns
type: Concept
preferred label: skogsfinnar @sv
preferred label: metsäsuomalaiset @fi