trends
type: Concept
source: Suomen kielen perussanakirja
comment: 1) jonkin ilmiön kehityksen (määrätietojen avulla laskettavissa oleva) suunta, suuntaus; 2) leimallinen, näkyvä piirre (nykyisessä) muodissa, käyttäytymisessä tms.
broader: societal accomplishments
in scheme: conceptscheme
preferred label: trendit @fi
preferred label: trender @sv
related: tendencies

tendencies
type: Concept
preferred label: riktningar @sv
preferred label: suuntaukset @fi
related: trends

societal accomplishments
type: Concept
narrower: trends
preferred label: yhteiskunnalliset tuotokset @fi