Töllinmäki
type: Concept
comment: F. E. Sillanpään nuoruudenkoti ja esikoisteoksen syntypaikka Hämeenkyrössä
broader: kulturhistoriska byggnader
in scheme: conceptscheme

kulturhistoriska byggnader
type: Concept
narrower: Töllinmäki
preferred label: cultural historical buildings @en
preferred label: kulttuurihistorialliset rakennukset @fi