opetusneuvokset (arvonimet)
type: Concept
comment: In singular 'opetusneuvos', in plural 'opetusneuvokset'.
alternative label: opetusneuvokset
broader: arvonimet
in scheme: conceptscheme
preferred label: opetusneuvokset (honorary titles) @en

arvonimet
type: Concept
narrower: opetusneuvokset (arvonimet)
preferred label: titlar @sv
preferred label: titles @en