elektronisk krigföring
type: Concept
broader: krig
in scheme: conceptscheme
preferred label: elektroninen sodankäynti @fi
preferred label: electric warfare @en
related: informationskrigföring
scope note: Krigföring med hjälp av medel och motmedel, baserade bl.a. på utnyttjande av elektronik, teleteknik och optik.
scope note: Elektroninen sodankäynti on sähkömagneettisen tai suunnatun energian käyttöön perustuvaa tiedustelua ja valvontaa, vaikuttamista sekä suojautumista edellä mainittujen toimintojen vaikutuksilta

krig
type: Concept
narrower: elektronisk krigföring
preferred label: war @en
preferred label: sota @fi

informationskrigföring
type: Concept
preferred label: information warfare @en
preferred label: informaatiosodankäynti @fi
related: elektronisk krigföring