länsrätter
type: Concept
broader: förvaltningsdomstolar
in scheme: conceptscheme
preferred label: provincial courts @en
preferred label: lääninoikeudet @fi
related: förvaltningsdomstolar
scope note: Hallinto-oikeuksista 31.10.1999 asti käytetty nimitys
scope note: Benämningen användes t.o.m. 31.10.1999, därefter därefter används termen förvaltningsrätt.

förvaltningsdomstolar
type: Concept
preferred label: hallinto-oikeudet @fi
preferred label: administrative courts @en
related: länsrätter

förvaltningsdomstolar
type: Concept
narrower: länsrätter
preferred label: administration courts @en
preferred label: hallintotuomioistuimet @fi