vetenskapsmän
type: Concept
broader: forskare
in scheme: conceptscheme
preferred label: tiedemiehet @fi
preferred label: scientists @en
related: kvinnliga forskare
scope note: Registret upptar benämningar på olika vetenskapsidkare; även andra vetenskapsidkare kan användas som ämnesord, t.ex. biologer
scope note: Sanasto sisältää joidenkin alojen tieteenharjoittajien nimityksiä; myös kaikkia muita voi käyttää asiasanoina, esim. biologit

kvinnliga forskare
type: Concept
preferred label: female scientists @en
preferred label: tiedenaiset @fi
related: vetenskapsmän

forskare
type: Concept
narrower: vetenskapsmän
preferred label: researchers @en
preferred label: tutkijat @fi