profiling
type: Concept
source: Suomen kielen perussanakirja
comment: 1) varustaa profiililla; 2) luoda tuotteelle tms. profiili; 3) määrittää jonkin ihmisryhmän koostumus tai määräomaisuudet
broader: cognition
in scheme: conceptscheme
preferred label: profilering @sv
preferred label: profilointi @fi

cognition
type: Concept
narrower: profiling
preferred label: kognition @sv
preferred label: kognitio @fi