skientismi
type: Concept
source: http://www.skepsis.fi/ihmeellinen/skientismi.html
comment: Skientismi eli tieteisuskovaisuus on käsitys, jonka mukaan ainoastaan tiede tuottaa pätevää tietoa maailmasta, ja että tiede pystyy ratkaisemaan kaikki mukaan lukien poliittiset ja moraalifilosofiset ongelmat.
broader: aatteet
in scheme: conceptscheme
preferred label: scientism @en
related: positivismi

aatteet
type: Concept
narrower: skientismi
preferred label: ideer @sv
preferred label: ideas @en

positivismi
type: Concept
preferred label: positivism @sv
related: skientismi