service producers
type: Concept
broader: producers
in scheme: conceptscheme
preferred label: palveluntuottajat @fi
preferred label: tjänsteproducenter @sv
scope note: Organisaatio tai yksittäinen henkilö, joka saa aikaan palveluja. Sosiaali- ja terveydenhuollossa palveluntuottajista erotetaan yleensä varsinaiset palvelua antavat organisaatioiden osat tai yksittäiset henkilöt eli palvelunantajat. Esimerkiksi yliopistollinen sairaala voi olla palveluntuottaja ja sen silmäpoliklinikka palvelunantaja

producers
type: Concept
narrower: service producers
preferred label: producenter @sv
preferred label: tuottajat @fi