sijoittajaviestintä
type: Concept
source: Lähde: Taloussanasto
alternative label: sijoittajasuhteet
broader: viestintä
in scheme: conceptscheme
preferred label: investerarrelationer @sv
preferred label: investor communication @en
scope note: Tarkoittaa yhteyksiä rahoittajiin, sijoittajiin, sijoitustutkijoihin ja pörssitoimittajiin tiedon välittämiseksi yhtiöstä sijoituskohteena

viestintä
type: Concept
narrower: sijoittajaviestintä
preferred label: kommunikation @sv
preferred label: communication @en

viestintä osallistujien mukaan
type: Collection
member: sijoittajaviestintä